Reaction Details
TargetHepatocyte growth factor receptor
LigandBDBM98027
Substrate/Competitorn/a
Meas. Tech.In Vitro c-Met Kinase Enzyme Assays
IC50 0.550±n/a nM
Citation Zhuo, JHe, CYao, W Imidazo[1,2-B][1,2,4]triazines as c-Met inhibitors US Patent US10919901 Publication Date 2/16/2021
 
Hepatocyte growth factor receptor
Name:Hepatocyte growth factor receptor
Type:Protein
Mol. Mass.:155559.73
Organism:Homo sapiens (Human)
Description:P08581
Residue:1390
BDBM98027
NameBDBM98027
Synonyms:US10472367, Compound Formula I US8487096, I | US9221824, Formula I
TypeSmall organic molecule
Emp. Form.C25H21FN6O2
Mol. Mass.456.4716
SMILESC[C@@H](O)CNC(=O)c1ccc(cc1F)-c1cnc2ncc(Cc3ccc4ncccc4c3)n2n1