Reaction Details
TargetIsocitrate dehydrogenase [NADP] cytoplasmic [R132H]
LigandBDBM279884
Substrate/Competitorn/a
Meas. Tech.In Vitro Assays for IDH1m (R132H or R132C) Inhibitors
IC50<50±n/a nM
Citation Konteatis, ZDPopovici-Muller, JTravins, JZahler, RCai, ZZhou, D Therapeutically active compounds and their methods of use US Patent US10946023 Publication Date 3/16/2021
 
Isocitrate dehydrogenase [NADP] cytoplasmic [R132H]
Name:Isocitrate dehydrogenase [NADP] cytoplasmic [R132H]
Type:Protein
Mol. Mass.:46641.74
Organism:Homo sapiens (Human)
Description:Human IDH1 R132H (SEQ ID No. 2 in patent). First three are removed. Google patent parsed wrong.
Residue:414
BDBM279884
NameBDBM279884
Synonyms:US10028961, Compound 31 US10946023, Compound 31
TypeSmall organic molecule
Emp. Form.C19H19F7N6
Mol. Mass.464.3832
SMILESFC(F)(F)c1cccc(n1)-c1nc(NC2CCC(F)(F)C2)nc(NC2CCC(F)(F)C2)n1