Reaction Details
TargetIsocitrate dehydrogenase [NADP] cytoplasmic [R132C]
LigandBDBM279884
Substrate/Competitorn/a
Meas. Tech.In Vitro Assays for IDH1m (R132H or R132C) Inhibitors
IC50<50±n/a nM
Citation Konteatis, ZDPopovici-Muller, JTravins, JZahler, RCai, ZZhou, D Therapeutically active compounds and their methods of use US Patent US10946023 Publication Date 3/16/2021
 
Isocitrate dehydrogenase [NADP] cytoplasmic [R132C]
Name:Isocitrate dehydrogenase [NADP] cytoplasmic [R132C]
Type:Enzyme Catalytic Domain
Mol. Mass.:46607.23
Organism:Homo sapiens (Human)
Description:O75874[R132C]
Residue:414
BDBM279884
NameBDBM279884
Synonyms:US10028961, Compound 31 US10946023, Compound 31
TypeSmall organic molecule
Emp. Form.C19H19F7N6
Mol. Mass.464.3832
SMILESFC(F)(F)c1cccc(n1)-c1nc(NC2CCC(F)(F)C2)nc(NC2CCC(F)(F)C2)n1