Reaction Details
TargetTyrosine-protein kinase JAK1
LigandBDBM277399
Substrate/Competitorn/a
Meas. Tech.Biochemical JAK Assays
Ki<0.1±n/a nM
Citation Hudson, RKozak, JPodesto, DDHuang, XThalladi, VR Methods for treating ulcerative colitis using 3-((1R,3s,5S)-3-((7-((5-methyl-1H-pyrazol-3-yl)amino)-1,6-naphthyridin-5-yl)amino)-8-azabicyclo[3.2.1]octan-8-yl)propanenitrile US Patent US10947254 Publication Date 3/16/2021
 
Tyrosine-protein kinase JAK1
Name:Tyrosine-protein kinase JAK1
Type:Protein
Mol. Mass.:133293.73
Organism:Homo sapiens (Human)
Description:P23458
Residue:1154
BDBM277399
NameBDBM277399
Synonyms:N5-((1R,3s,5S)-9-(ethylsulfonyl)-9-azabicyclo[3.3.1]nonan-3-yl)-N7-(5-methyl-1H-pyrazol-3-yl)-1,6-naphthyridine-5,7-diamine US10947254, Example 10 | US11780852, Example 10
TypeSmall organic molecule
Emp. Form.C22H29N7O2S
Mol. Mass.455.576
SMILESCCS(=O)(=O)N1[C@H]2CCC[C@@H]1C[C@H](C2)Nc1nc(Nc2cc(C)[nH]n2)cc2ncccc12