Reaction Details
TargetMitogen-activated protein kinase kinase kinase 12
LigandBDBM301581
Substrate/Competitorn/a
Meas. Tech.DLK TR-FRET Inhibition Assay
Ki 32.7±n/a nM
Citation Estrada, APatel, SKellar, THuestis, MShore, DSiu, M Tricyclic DLK inhibitors and uses thereof US Patent US10131675 Publication Date 11/20/2018
 
Mitogen-activated protein kinase kinase kinase 12
Name:Mitogen-activated protein kinase kinase kinase 12
Type:PROTEIN
Mol. Mass.:93216.56
Organism:Homo sapiens (Human)
Description:ChEMBL_1460553
Residue:859
BDBM301581
NameBDBM301581
Synonyms:US10131675, Example 67
TypeSmall organic molecule
Emp. Form.C23H25F2N7O
Mol. Mass.453.4877
SMILESCC(C)c1c[nH]c2ncc(cc12)-c1nc(N2CC(F)(F)C2)c2nc3n(CCOC3(C)C)c2n1