Reaction Details
TargetMitogen-activated protein kinase kinase kinase 12
LigandBDBM301624
Substrate/Competitorn/a
Meas. Tech.DLK TR-FRET Inhibition Assay
Ki 1.25±n/a nM
Citation Estrada, APatel, SKellar, THuestis, MShore, DSiu, M Tricyclic DLK inhibitors and uses thereof US Patent US10131675 Publication Date 11/20/2018
 
Mitogen-activated protein kinase kinase kinase 12
Name:Mitogen-activated protein kinase kinase kinase 12
Type:PROTEIN
Mol. Mass.:93216.56
Organism:Homo sapiens (Human)
Description:ChEMBL_1460553
Residue:859
BDBM301624
NameBDBM301624
Synonyms:US10131675, Example 110
TypeSmall organic molecule
Emp. Form.C21H19ClN8O
Mol. Mass.434.882
SMILESCC1(C)OCCn2c1nc1c(nc(nc21)-c1cnc2[nH]cc(Cl)c2c1)N1CC(C1)C#N