Reaction Details
TargetMitogen-activated protein kinase kinase kinase 12
LigandBDBM301630
Substrate/Competitorn/a
Meas. Tech.DLK TR-FRET Inhibition Assay
Ki 21.3±n/a nM
Citation Estrada, APatel, SKellar, THuestis, MShore, DSiu, M Tricyclic DLK inhibitors and uses thereof US Patent US10131675 Publication Date 11/20/2018
 
Mitogen-activated protein kinase kinase kinase 12
Name:Mitogen-activated protein kinase kinase kinase 12
Type:PROTEIN
Mol. Mass.:93216.56
Organism:Homo sapiens (Human)
Description:ChEMBL_1460553
Residue:859
BDBM301630
NameBDBM301630
Synonyms:US10131675, Example 116
TypeSmall organic molecule
Emp. Form.C20H23N7O
Mol. Mass.377.4429
SMILESCC1(C)OCCn2c1nc1c(nc(cc21)-c1cnc(N)nc1)N1CC2CC1C2