Reaction Details
TargetMitogen-activated protein kinase kinase kinase 12
LigandBDBM301657
Substrate/Competitorn/a
Meas. Tech.DLK TR-FRET Inhibition Assay
Ki 2.23±n/a nM
Citation Estrada, APatel, SKellar, THuestis, MShore, DSiu, M Tricyclic DLK inhibitors and uses thereof US Patent US10131675 Publication Date 11/20/2018
 
Mitogen-activated protein kinase kinase kinase 12
Name:Mitogen-activated protein kinase kinase kinase 12
Type:PROTEIN
Mol. Mass.:93216.56
Organism:Homo sapiens (Human)
Description:ChEMBL_1460553
Residue:859
BDBM301657
NameBDBM301657
Synonyms:US10131675, Example 144
TypeSmall organic molecule
Emp. Form.C22H23N7O
Mol. Mass.401.4643
SMILESCC1(C)OCCn2c1nc1c(nc(cc21)-c1cnc(N)c(c1)C#N)N1CC2CC1C2