Reaction Details
TargetLysine-specific histone demethylase 1A
LigandBDBM283269
Substrate/Competitorn/a
Meas. Tech.In Vitro Enzyme Inhibition Assay
IC50<100±n/a nM
Citation Xu, JCho, RNguyen, A Treatment of relapsed and/or refractory solid tumors and non-hodgkin's lymphomas US Patent US10960005 Publication Date 3/30/2021
 
Lysine-specific histone demethylase 1A
Name:Lysine-specific histone demethylase 1A
Type:Enzyme
Mol. Mass.:92901.01
Organism:Homo sapiens (Human)
Description:O60341
Residue:852
BDBM283269
NameBDBM283269
Synonyms:2-fluoro-4-{5-(4-methoxy-phenyl)- 1-methyl-6-oxo-2-[(3R)-(pyrrolidin- 3-ylmethyl)-amino]-1,6-dihydro- pyrimidin-4-yl}-benzonitrile US10207999, Example 52 US10548896, Example 52 US10960005, Example 52 US9573930, Example 52 US9776974, Example 52
TypeSmall organic molecule
Emp. Form.C24H24FN5O2
Mol. Mass.433.4781
SMILESCOc1ccc(cc1)-c1c(nc(NC[C@@H]2CCNC2)n(C)c1=O)-c1ccc(C#N)c(F)c1