Reaction Details
TargetHeat shock protein HSP 90-alpha
LigandBDBM210948
Substrate/Competitorn/a
Meas. Tech.Fluorescence Polarization
Kd>100000±n/a nM
Citation Mishra, SJBlagg, BSDickey, CA Grp94 selective inhibitors and uses thereof US Patent US10975030 Publication Date 4/13/2021
 
Heat shock protein HSP 90-alpha
Name:Heat shock protein HSP 90-alpha
Type:Molecular Chaperone
Mol. Mass.:84623.45
Organism:Homo sapiens (Human)
Description:P07900
Residue:732
BDBM210948
NameBDBM210948
Synonyms:2-(((1r,4r)-4-hydroxycyclohexyl)amino)-4-(2-(pyridin-4-yl)-1H-pyrrol-1-yl)benzamide (5j) | US10975030, Compound 5j
TypeSmall organic molecule
Emp. Form.C22H24N4O2
Mol. Mass.376.4516
SMILESNC(=O)c1ccc(cc1NC1CCC(O)CC1)-n1cccc1-c1ccncc1