Reaction Details
TargetHeat shock protein HSP 90-alpha
LigandBDBM210955
Substrate/Competitorn/a
Meas. Tech.Fluorescence Polarization
Kd>100000±n/a nM
Citation Mishra, SJBlagg, BSDickey, CA Grp94 selective inhibitors and uses thereof US Patent US10975030 Publication Date 4/13/2021
 
Heat shock protein HSP 90-alpha
Name:Heat shock protein HSP 90-alpha
Type:Molecular Chaperone
Mol. Mass.:84623.45
Organism:Homo sapiens (Human)
Description:P07900
Residue:732
BDBM210955
NameBDBM210955
Synonyms:4-(2-(3-fluorobenzyl)-1H-pyrrol-1-yl)-2-(((1r,4r)-4-hydroxycyclohexyl)amino)benzamide (8f) | US10975030, Compound 8f
TypeSmall organic molecule
Emp. Form.C24H26FN3O2
Mol. Mass.407.4805
SMILESNC(=O)c1ccc(cc1NC1CCC(O)CC1)-n1cccc1Cc1cccc(F)c1