Reaction Details
TargetCytosolic phospholipase A2
LigandBDBM301777
Substrate/Competitorn/a
Meas. Tech.In Vitro cPLA2 Assay
IC50>5000±n/a nM
Citation Kokotos, GJohansen, BMagrioti, VTsakos, M 2-oxothiazole compounds and method of using same for chronic inflammatory disorders US Patent US9597318 Publication Date 3/21/2017
 
Cytosolic phospholipase A2
Name:Cytosolic phospholipase A2
Type:Protein
Mol. Mass.:85219.30
Organism:Homo sapiens (Human)
Description:P47712
Residue:749
BDBM301777
NameBDBM301777
Synonyms:US9597318, Code GK159
TypeSmall organic molecule
Emp. Form.C18H17NOS
Mol. Mass.295.399
SMILESO=C(CCCCc1ccccc1)c1nc2ccccc2s1