Reaction Details
TargetReplicase polyprotein 1ab
LigandBDBM423411
Substrate/Competitorn/a
Meas. Tech.Various Assay
IC50 38±n/a nM
Citation Chia, CSBXu, WNg, PS A patent review on SARS coronavirus main protease (3CLpro) inhibitors. ChemMedChem0:0 (2021) 
 
Replicase polyprotein 1ab
Name:Replicase polyprotein 1ab
Type:Protein
Mol. Mass.:790250.81
Organism:Human SARS coronavirus (SARS-CoV) (Severe acute respiratory syndrome coronavirus)
Description:P0C6X7
Residue:7073
BDBM423411
NameBDBM423411
Synonyms:US11753373, Compound A-1-h cmdc.202100576, 6c
TypeSmall Organic Molecule
Emp. Form.C23H30N4O5
Mol. Mass.442.5081
SMILESCC(C)C[C@H](NC(=O)c1cc2ccccc2[nH]1)C(=O)N[C@@H](C[C@@H]1CCNC1=O)C(=O)CO