Reaction Details
TargetReplicase polyprotein 1ab
LigandBDBM496940
Substrate/Competitorn/a
Meas. Tech.Various Assay
IC50 35±n/a nM
Citation Chia, CSBXu, WNg, PS A patent review on SARS coronavirus main protease (3CLpro) inhibitors. ChemMedChem0:0 (2021) 
 
Replicase polyprotein 1ab
Name:Replicase polyprotein 1ab
Type:Protein
Mol. Mass.:790250.81
Organism:Human SARS coronavirus (SARS-CoV) (Severe acute respiratory syndrome coronavirus)
Description:P0C6X7
Residue:7073
BDBM496940
NameBDBM496940
Synonyms:cmdc.202100576, 18c
TypeSmall organic molecule
Emp. Form.C28H34FN5O4
Mol. Mass.523.5991
SMILESCC(C)[C@H](NC(=O)c1cncc(F)c1)C(=O)N[C@@H](Cc1ccccc1)C(=C)N[C@@H](CC1CCNC1=O)C=O