Reaction Details
TargetReplicase polyprotein 1ab
LigandBDBM496941
Substrate/Competitorn/a
Meas. Tech.Various Assay
IC50 50±n/a nM
Citation Chia, CSBXu, WNg, PS A patent review on SARS coronavirus main protease (3CLpro) inhibitors. ChemMedChem0:0 (2021) 
 
Replicase polyprotein 1ab
Name:Replicase polyprotein 1ab
Type:Protein
Mol. Mass.:790250.81
Organism:Human SARS coronavirus (SARS-CoV) (Severe acute respiratory syndrome coronavirus)
Description:P0C6X7
Residue:7073
BDBM496941
NameBDBM496941
Synonyms:cmdc.202100576, 18d
TypeSmall organic molecule
Emp. Form.C30H35N5O5
Mol. Mass.545.6294
SMILESCC(C)[C@H](NC(=O)c1cc2ccccc2[nH]1)C(=O)N[C@@H](Cc1ccccc1)C(=O)N[C@@H](CC1CCNC1=O)C=O