Reaction Details
TargetReplicase polyprotein 1ab
LigandBDBM496954
Substrate/Competitorn/a
Meas. Tech.Various Assay
IC50 6.60±n/a nM
Citation Chia, CSBXu, WNg, PS A patent review on SARS coronavirus main protease (3CLpro) inhibitors. ChemMedChem0:0 (2021) 
 
Replicase polyprotein 1ab
Name:Replicase polyprotein 1ab
Type:Protein
Mol. Mass.:790250.81
Organism:Human SARS coronavirus (SARS-CoV) (Severe acute respiratory syndrome coronavirus)
Description:P0C6X7
Residue:7073
BDBM496954
NameBDBM496954
Synonyms:cmdc.202100576, 22b
TypeSmall organic molecule
Emp. Form.C47H62N6O9
Mol. Mass.855.03
SMILESCC(C)(C)NC(=O)C(=O)[C@H](C[C@@H]1CCNC1=O)NC(=O)[C@H](CC1CCCCC1)NC(=O)[C@H](Cc1cccc2ccccc12)NC(=O)OCc1ccc(OCN2CCOCC2)cc1