Reaction Details
TargetReplicase polyprotein 1ab
LigandBDBM496958
Substrate/Competitorn/a
Meas. Tech.Various Assay
IC50 7.00±n/a nM
Citation Chia, CSBXu, WNg, PS A patent review on SARS coronavirus main protease (3CLpro) inhibitors. ChemMedChem0:0 (2021) 
 
Replicase polyprotein 1ab
Name:Replicase polyprotein 1ab
Type:Protein
Mol. Mass.:790250.81
Organism:Human SARS coronavirus (SARS-CoV) (Severe acute respiratory syndrome coronavirus)
Description:P0C6X7
Residue:7073
BDBM496958
NameBDBM496958
Synonyms:cmdc.202100576, 22f
TypeSmall organic molecule
Emp. Form.C33H49FN6O7
Mol. Mass.660.7766
SMILESCC(C)C[C@H](NC(=O)[C@H](CN1CCC(F)CC1)NC(=O)OCc1ccccc1)C(=O)N[C@@H](C[C@@H]1CCNC1=O)C(=O)C(=O)NC(C)C