Reaction Details
TargetLysine-specific demethylase 4C
LigandBDBM270531
Substrate/Competitorn/a
Meas. Tech.In Vitro Enzyme Inhibition Assay
IC50 550±n/a nM
Citation Chen, YKWallace, MB Histone demethylase inhibitors US Patent US11001568 Publication Date 5/11/2021
 
Lysine-specific demethylase 4C
Name:Lysine-specific demethylase 4C
Type:Protein
Mol. Mass.:119979.01
Organism:Homo sapiens (Human)
Description:Q9H3R0
Residue:1056
BDBM270531
NameBDBM270531
Synonyms:(S)-3-(((5-((4-ethylphenyl)(methyl)amino)-2-methylisoindolin-1-yl)methyl)amino)isonicotinic acid US11001568, Example 19B
TypeSmall organic molecule
Emp. Form.C25H28N4O2
Mol. Mass.416.5154
SMILESCCc1ccc(cc1)N(C)c1ccc2[C@@H](CNc3cnccc3C(O)=O)N(C)Cc2c1