Reaction Details
TargetLysine-specific demethylase 6B
LigandBDBM270531
Substrate/Competitorn/a
Meas. Tech.In Vitro Enzyme Inhibition Assay
IC50 5500±n/a nM
Citation Chen, YKWallace, MB Histone demethylase inhibitors US Patent US11001568 Publication Date 5/11/2021
 
Lysine-specific demethylase 6B
Name:Lysine-specific demethylase 6B
Type:Protein
Mol. Mass.:176672.55
Organism:Homo sapiens (Human)
Description:O15054
Residue:1643
BDBM270531
NameBDBM270531
Synonyms:(S)-3-(((5-((4-ethylphenyl)(methyl)amino)-2-methylisoindolin-1-yl)methyl)amino)isonicotinic acid US11001568, Example 19B
TypeSmall organic molecule
Emp. Form.C25H28N4O2
Mol. Mass.416.5154
SMILESCCc1ccc(cc1)N(C)c1ccc2[C@@H](CNc3cnccc3C(O)=O)N(C)Cc2c1