Reaction Details
TargetN-formyl peptide receptor 2
LigandBDBM497407
Substrate/Competitorn/a
Meas. Tech.cAMP Assay
EC50 0.180±n/a nM
Citation Shirude, PSChattopadhyay, AKRachamreddy, CWurtz, NRKick, EK Piperidinone formyl peptide 2 receptor agonists US Patent US11008301 Publication Date 5/18/2021
 
N-formyl peptide receptor 2
Name:N-formyl peptide receptor 2
Type:G Protein-Coupled Receptor (GPCR)
Mol. Mass.:38968.35
Organism:Homo sapiens (Human)
Description:P25090
Residue:351
BDBM497407
NameBDBM497407
Synonyms:US11008301, Example 77
TypeSmall organic molecule
Emp. Form.C26H32F3N5O2
Mol. Mass.503.5598
SMILESCN(C)C1CCCN(C1)c1ccc(cc1)N1CCC[C@@H](NC(=O)Nc2ccc(cc2)C(F)(F)F)C1=O