Reaction Details
TargetN-formyl peptide receptor 2
LigandBDBM497409
Substrate/Competitorn/a
Meas. Tech.cAMP Assay
EC50 0.390±n/a nM
Citation Shirude, PSChattopadhyay, AKRachamreddy, CWurtz, NRKick, EK Piperidinone formyl peptide 2 receptor agonists US Patent US11008301 Publication Date 5/18/2021
 
N-formyl peptide receptor 2
Name:N-formyl peptide receptor 2
Type:G Protein-Coupled Receptor (GPCR)
Mol. Mass.:38968.35
Organism:Homo sapiens (Human)
Description:P25090
Residue:351
BDBM497409
NameBDBM497409
Synonyms:US11008301, Example 83
TypeSmall organic molecule
Emp. Form.C24H29ClFN5O2
Mol. Mass.473.971
SMILESCN(C)C1CCN(C1)c1ccc(cc1F)N1CCC[C@@H](NC(=O)Nc2ccc(Cl)cc2)C1=O