Reaction Details
TargetGlutaminyl-peptide cyclotransferase
LigandBDBM7886
Substrate/CompetitorBDBM7883
Meas. Tech.QC Inhibition Testing
pH8±n/a
Temperature303.15±n/a K
Ki 4600000±38000 nM
Citation Buchholz, MHeiser, USchilling, SNiestroj, AJZunkel, KDemuth, HU The first potent inhibitors for human glutaminyl cyclase: synthesis and structure-activity relationship. J Med Chem49:664-77 (2006) 
 
Glutaminyl-peptide cyclotransferase
Name:Glutaminyl-peptide cyclotransferase
Type:Enzyme
Mol. Mass.:40877.05
Organism:Homo sapiens (Human)
Description:Q16769
Residue:361
BDBM7886
BDBM7883
NameBDBM7886
Synonyms:1-PIM 1-phenylimidazole US9138393, 1-Phenyl- imidazole | US9144538, 1-Phenylimidazole
TypeSmall organic molecule
Emp. Form.C9H8N2
Mol. Mass.144.1732
SMILESc1cn(cn1)-c1ccccc1