Reaction Details
TargetGlutaminyl-peptide cyclotransferase
LigandBDBM7887
Substrate/CompetitorBDBM7883
Meas. Tech.QC Inhibition Testing
pH8±n/a
Temperature303.15±n/a K
Ki 7000±500 nM
Citation Buchholz, MHeiser, USchilling, SNiestroj, AJZunkel, KDemuth, HU The first potent inhibitors for human glutaminyl cyclase: synthesis and structure-activity relationship. J Med Chem49:664-77 (2006) 
 
Glutaminyl-peptide cyclotransferase
Name:Glutaminyl-peptide cyclotransferase
Type:Enzyme
Mol. Mass.:40877.05
Organism:Homo sapiens (Human)
Description:Q16769
Residue:361
BDBM7887
BDBM7883
NameBDBM7887
Synonyms:1-Benzylimidazole (BI) 1-benzylimidazole US9138393, 1-benzylimidazole
TypeSmall organic molecule
Emp. Form.C10H10N2
Mol. Mass.158.1998
SMILESC(c1ccccc1)n1ccnc1