Reaction Details
TargetTyrosine-protein kinase SYK
LigandBDBM301997
Substrate/Competitorn/a
Meas. Tech.Homogeneous Time-Resolved Fluorescence (HTRF) Assay
IC50 0.516±n/a nM
Citation Altman, MDAndresen, BMArrington, KLChilders, KKDi Francesco, MEEllis, JMHaidle, AMLiu, YNorthrup, ABO Boyle, BOtte, RDReutershan, MHVitharana, DWoo, HC Thiazole-substituted aminopyridines as spleen tyrosine kinase inhibitors US Patent US9598405 Publication Date 3/21/2017
 
Tyrosine-protein kinase SYK
Name:Tyrosine-protein kinase SYK
Type:Enzyme
Mol. Mass.:72079.99
Organism:Homo sapiens (Human)
Description:P43405
Residue:635
BDBM301997
NameBDBM301997
Synonyms:US9598405, 1.5 | US9598405, 1.6
TypeSmall Organic Molecule
Emp. Form.C23H24F3N5O3S
Mol. Mass.507.529
SMILESCC1(C)C[C@](O)(CC[C@@H]1C(O)=O)c1ncc(s1)-c1cc(N)cc(Nc2cc(ccn2)C(F)(F)F)n1