Reaction Details
TargetTyrosine-protein kinase SYK
LigandBDBM302034
Substrate/Competitorn/a
Meas. Tech.Homogeneous Time-Resolved Fluorescence (HTRF) Assay
IC50 0.508±n/a nM
Citation Altman, MDAndresen, BMArrington, KLChilders, KKDi Francesco, MEEllis, JMHaidle, AMLiu, YNorthrup, ABO Boyle, BOtte, RDReutershan, MHVitharana, DWoo, HC Thiazole-substituted aminopyridines as spleen tyrosine kinase inhibitors US Patent US9598405 Publication Date 3/21/2017
 
Tyrosine-protein kinase SYK
Name:Tyrosine-protein kinase SYK
Type:Enzyme
Mol. Mass.:72079.99
Organism:Homo sapiens (Human)
Description:P43405
Residue:635
BDBM302034
NameBDBM302034
Synonyms:BDBM302035 | US9598405, 4.1
TypeSmall Organic Molecule
Emp. Form.C25H25F3N4O3S
Mol. Mass.518.551
SMILESCc1cc(Nc2cc(ccn2)C(F)(F)F)nc(c1)-c1cnc(s1)C1(O)CC2(CCCCC2)C1C(O)=O