null
SMILES: CC(=O)Nc1cc2-c3ccccc3-c3cccc(c1)c23
InChI Key: InChIKey=DCGVCFDUNWGKEI-UHFFFAOYSA-N
Activity Spreadsheet -- Enzyme Inhibition Constant Data from BindingDB
Found 1 hit for monomerid = 100167
Trg + Lig
Ki
nM
ΔG°
kcal/mole
IC50
nM
Kd
nM
EC50/IC50
nM
koff
s-1
kon
M-1s-1
pHTemp
°C
Kallikrein-7
(Homo sapiens (Human))
BDBM100167
(MLS002694422 | N-(2-fluoranthenyl)acetamide | N-fl...)
Show SMILES CC(=O)Nc1cc2-c3ccccc3-c3cccc(c1)c23
Show InChI InChI=1S/C18H13NO/c1-11(20)19-13-9-12-5-4-8-16-14-6-2-3-7-15(14)17(10-13)18(12)16/h2-10H,1H3,(H,19,20)
Reactome pathway
PCBioAssay
n/an/an/an/a 8.84E+3n/an/an/an/a
The Scripps Research Institute Molecular Screening Center
Curated by PubChem BioAssay
PubChem Bioassay (2013)
BindingDB Entry DOI: 10.7270/Q29G5KF0