BDBM100345 US8501981, 73
SMILES: CC(C)(NC(=O)c1ccc2ccccc2c1OCCOc1ccc(F)c(Cl)c1)C(O)=O
InChI Key: InChIKey=QEOOFORYFFDGJY-UHFFFAOYSA-N
Data: 1 IC50
Activity Spreadsheet -- Enzyme Inhibition Constant Data from BindingDB
Found 1 hit for monomerid = 100345
Trg + Lig
Ki
nM
ΔG°
kcal/mole
IC50
nM
Kd
nM
EC50/IC50
nM
koff
s-1
kon
M-1s-1
pHTemp
°C
C-X-C chemokine receptor type 2
(Homo sapiens (Human))
BDBM100345
(US8501981, 73)
Show SMILES CC(C)(NC(=O)c1ccc2ccccc2c1OCCOc1ccc(F)c(Cl)c1)C(O)=O
Show InChI InChI=1S/C23H21ClFNO5/c1-23(2,22(28)29)26-21(27)17-9-7-14-5-3-4-6-16(14)20(17)31-12-11-30-15-8-10-19(25)18(24)13-15/h3-10,13H,11-12H2,1-2H3,(H,26,27)(H,28,29)
Reactome pathway
US Patent
n/an/a 1.25E+3n/an/an/an/an/an/a
SANOFI
US Patent
Assay Description
CXCR2 inhibition using calcium fluorescence assay (FLIPR).
US Patent US8501981 (2013)
BindingDB Entry DOI: 10.7270/Q24Q7SMB