BDBM100469 US8501732, I-29
SMILES: Clc1ccc2c(c1)n(cc(CNC(=O)c1ccn(Cc3ccccc3)c(=O)c1)c2=O)-c1ccccc1
InChI Key: InChIKey=QPPKZICQXCRTQL-UHFFFAOYSA-N
Data: 1 IC50
Activity Spreadsheet -- Enzyme Inhibition Constant Data from BindingDB
Found 1 hit for monomerid = 100469
Trg + Lig
Ki
nM
ΔG°
kcal/mole
IC50
nM
Kd
nM
EC50/IC50
nM
koff
s-1
kon
M-1s-1
pHTemp
°C
Mitogen-activated protein kinase 8
(Homo sapiens (Human))
BDBM100469
(US8501732, I-29)
Show SMILES Clc1ccc2c(c1)n(cc(CNC(=O)c1ccn(Cc3ccccc3)c(=O)c1)c2=O)-c1ccccc1
Show InChI InChI=1S/C29H22ClN3O3/c30-23-11-12-25-26(16-23)33(24-9-5-2-6-10-24)19-22(28(25)35)17-31-29(36)21-13-14-32(27(34)15-21)18-20-7-3-1-4-8-20/h1-16,19H,17-18H2,(H,31,36)
NCI pathway
Reactome pathway
US Patent
n/an/a 13n/an/an/an/an/an/a
Hoffmann-La Roche Inc.
US Patent
Assay Description
In vitro JNK1 assay.
US Patent US8501732 (2013)
BindingDB Entry DOI: 10.7270/Q2RF5SP9