BDBM10082 (+)-(S)-(Z)-4-(3-Hydroxy-pyrrolidinyl)-3-(3-methoxy-1H-pyrrol-2-ylmethylene)-5-nitro-1,3-dihydro-indol-2-one::(3Z)-4-[(3S)-3-hydroxypyrrolidin-1-yl]-3-[(3-methoxy-1H-pyrrol-2-yl)methylidene]-5-nitro-2,3-dihydro-1H-indol-2-one::C-4 substituted oxindole inhibitor 7f
SMILES: COc1cc[nH]c1\C=C1/C(=O)Nc2ccc(c(N3CC[C@H](O)C3)c12)N(=O)=O
InChI Key: InChIKey=AIDMUEJGKCTNDD-DFYQSJSGSA-N
Data: 1 IC50
Activity Spreadsheet -- Enzyme Inhibition Constant Data from BindingDB
Found 1 hit for monomerid = 10082
Trg + Lig
Ki
nM
ΔG°
kcal/mole
IC50
nM
Kd
nM
EC50/IC50
nM
koff
s-1
kon
M-1s-1
pHTemp
°C
CDK2/CycE
(Homo sapiens (Human))
BDBM10082
((+)-(S)-(Z)-4-(3-Hydroxy-pyrrolidinyl)-3-(3-methox...)
Show SMILES COc1cc[nH]c1\C=C1/C(=O)Nc2ccc(c(N3CC[C@H](O)C3)c12)N(=O)=O |r|
Show InChI InChI=1S/C18H18N4O5/c1-27-15-4-6-19-13(15)8-11-16-12(20-18(11)24)2-3-14(22(25)26)17(16)21-7-5-10(23)9-21/h2-4,6,8,10,19,23H,5,7,9H2,1H3,(H,20,24)/b11-8-/t10-/m0/s1
n/an/a 5n/an/an/an/a7.522
Hoffmann-La Roche Inc.
Assay Description
Kinase assays were performed using a recombinant human cyclin E-CDK2 complex. The enzyme was assayed with substrate in the presence of 1uM ATP/[gamma...
Bioorg Med Chem 11: 1873-81 (2003)
Article DOI: 10.1016/s0968-0896(03)00036-1
BindingDB Entry DOI: 10.7270/Q24M92SM