BDBM10085 (3Z)-4-[3-(hydroxymethyl)piperidin-1-yl]-3-[(3-methoxy-1H-pyrrol-2-yl)methylidene]-5-nitro-2,3-dihydro-1H-indol-2-one::(Z)-4-(3-Hydroxymethyl-piperidinyl)-3-(3-methoxy-1H-pyrrol-2-ylmethylene) -5- nitro -1,3-dihydro-indol-2-one::C-4 substituted oxindole inhibitor 7i
SMILES: COc1cc[nH]c1\C=C1/C(=O)Nc2ccc(c(N3CCCC(CO)C3)c12)N(=O)=O
InChI Key: InChIKey=MQLFYKBUKMKFOK-LCYFTJDESA-N
Data: 1 IC50
Activity Spreadsheet -- Enzyme Inhibition Constant Data from BindingDB
Found 1 hit for monomerid = 10085
Trg + Lig
Ki
nM
ΔG°
kcal/mole
IC50
nM
Kd
nM
EC50/IC50
nM
koff
s-1
kon
M-1s-1
pHTemp
°C
CDK2/CycE
(Homo sapiens (Human))
BDBM10085
((3Z)-4-[3-(hydroxymethyl)piperidin-1-yl]-3-[(3-met...)
Show SMILES COc1cc[nH]c1\C=C1/C(=O)Nc2ccc(c(N3CCCC(CO)C3)c12)N(=O)=O
Show InChI InChI=1S/C20H22N4O5/c1-29-17-6-7-21-15(17)9-13-18-14(22-20(13)26)4-5-16(24(27)28)19(18)23-8-2-3-12(10-23)11-25/h4-7,9,12,21,25H,2-3,8,10-11H2,1H3,(H,22,26)/b13-9-
n/an/a 2n/an/an/an/a7.522
Hoffmann-La Roche Inc.
Assay Description
Kinase assays were performed using a recombinant human cyclin E-CDK2 complex. The enzyme was assayed with substrate in the presence of 1uM ATP/[gamma...
Bioorg Med Chem 11: 1873-81 (2003)
Article DOI: 10.1016/s0968-0896(03)00036-1
BindingDB Entry DOI: 10.7270/Q24M92SM