BDBM10090 (3Z)-4-(4-aminopiperidin-1-yl)-3-[(3-methoxy-1H-pyrrol-2-yl)methylidene]-5-nitro-2,3-dihydro-1H-indol-2-one::(Z)-4-(4-Amino-piperidinyl)-3-(3-methoxy-1H-pyrrol-2-ylmethylene) - 5 - nitro - 1,3 - dihydro - indol - 2 - one::C-4 substituted oxindole inhibitor 7n
SMILES: COc1cc[nH]c1\C=C1/C(=O)Nc2ccc(c(N3CCC(N)CC3)c12)N(=O)=O
InChI Key: InChIKey=GVZIXNLACUFDEL-BENRWUELSA-N
Data: 1 IC50
Activity Spreadsheet -- Enzyme Inhibition Constant Data from BindingDB
Found 1 hit for monomerid = 10090
Trg + Lig
Ki
nM
ΔG°
kcal/mole
IC50
nM
Kd
nM
EC50/IC50
nM
koff
s-1
kon
M-1s-1
pHTemp
°C
CDK2/CycE
(Homo sapiens (Human))
BDBM10090
((3Z)-4-(4-aminopiperidin-1-yl)-3-[(3-methoxy-1H-py...)
Show SMILES COc1cc[nH]c1\C=C1/C(=O)Nc2ccc(c(N3CCC(N)CC3)c12)N(=O)=O
Show InChI InChI=1S/C19H21N5O4/c1-28-16-4-7-21-14(16)10-12-17-13(22-19(12)25)2-3-15(24(26)27)18(17)23-8-5-11(20)6-9-23/h2-4,7,10-11,21H,5-6,8-9,20H2,1H3,(H,22,25)/b12-10-
n/an/a 5n/an/an/an/a7.522
Hoffmann-La Roche Inc.
Assay Description
Kinase assays were performed using a recombinant human cyclin E-CDK2 complex. The enzyme was assayed with substrate in the presence of 1uM ATP/[gamma...
Bioorg Med Chem 11: 1873-81 (2003)
Article DOI: 10.1016/s0968-0896(03)00036-1
BindingDB Entry DOI: 10.7270/Q24M92SM