BDBM101533 US8530494, 103::US8530652, 111::US8530652, 60
SMILES: CN(C)C[C@@H](NC(=O)N1Cc2c(Nc3ccnc(n3)C#N)[nH]nc2C1(C)C)c1ccccc1
InChI Key: InChIKey=DSCHESZZDGUKHJ-QGZVFWFLSA-N
Data: 1 KI  1 EC50
Activity Spreadsheet -- Enzyme Inhibition Constant Data from BindingDB
Found 1 hit for monomerid = 101533
Trg + Lig
Ki
nM
ΔG°
kcal/mole
IC50
nM
Kd
nM
EC50/IC50
nM
koff
s-1
kon
M-1s-1
pHTemp
°C
Serine/threonine-protein kinase PAK 4
(Homo sapiens (Human))
BDBM101533
(US8530494, 103 | US8530652, 111 | US8530652, 60)
Show SMILES CN(C)C[C@@H](NC(=O)N1Cc2c(Nc3ccnc(n3)C#N)[nH]nc2C1(C)C)c1ccccc1 |r|
Show InChI InChI=1S/C23H27N9O/c1-23(2)20-16(21(30-29-20)28-18-10-11-25-19(12-24)27-18)13-32(23)22(33)26-17(14-31(3)4)15-8-6-5-7-9-15/h5-11,17H,13-14H2,1-4H3,(H,26,33)(H2,25,27,28,29,30)/t17-/m1/s1
Reactome pathway
US Patent
40n/an/an/a<3.90n/an/an/an/a
Agouron Pharmaceuticals, Inc.; Pfizer Inc.
US Patent
Assay Description
The enzymatic activity of PAK4 KD was measured by its ability to catalyzed the transfer of a phosphate residue from a nucleoside triphosphate to an a...
US Patent US8530652 (2013)
BindingDB Entry DOI: 10.7270/Q2F18XC4