BDBM10157 lysine sulfonamide analogue 18::tert-butyl N-[(1S)-1-{[(5R)-5-[(4-aminobenzene)(2-methylpropyl)sulfonamido]-6-hydroxyhexyl]carbamoyl}-2,2-diphenylethyl]carbamate
SMILES: CC(C)CN(C(CO)CCCCNC(=O)[C@@H](NC(=O)OC(C)(C)C)C(c1ccccc1)c1ccccc1)S(=O)(=O)c1ccc(N)cc1
InChI Key: InChIKey=RIZQZYAOEOUMIE-OQGPVULJSA-N
Data: 1 KI  1 IC50
Activity Spreadsheet -- Enzyme Inhibition Constant Data from BindingDB
Found 1 hit for monomerid = 10157
Trg + Lig
Ki
nM
ΔG°
kcal/mole
IC50
nM
Kd
nM
EC50/IC50
nM
koff
s-1
kon
M-1s-1
pHTemp
°C
HIV-1 Protease
(Human immunodeficiency virus type 1)
BDBM10157
(lysine sulfonamide analogue 18 | tert-butyl N-[(1S...)
Show SMILES CC(C)CN(C(CO)CCCCNC(=O)[C@@H](NC(=O)OC(C)(C)C)C(c1ccccc1)c1ccccc1)S(=O)(=O)c1ccc(N)cc1 |r|
Show InChI InChI=1S/C36H50N4O6S/c1-26(2)24-40(47(44,45)31-21-19-29(37)20-22-31)30(25-41)18-12-13-23-38-34(42)33(39-35(43)46-36(3,4)5)32(27-14-8-6-9-15-27)28-16-10-7-11-17-28/h6-11,14-17,19-22,26,30,32-33,41H,12-13,18,23-25,37H2,1-5H3,(H,38,42)(H,39,43)/t30?,33-/m0/s1
0.5n/a 0.400n/an/an/an/an/an/a
Ambrilia Biopharma Inc.
Assay Description
HIV-1 protease activity was measured by a continuous fluorometric assay. The proteolytic activity can be monitored by the increase in fluorescence in...
Bioorg Med Chem Lett 16: 3459-62 (2006)
Article DOI: 10.1016/j.bmcl.2006.04.011
BindingDB Entry DOI: 10.7270/Q2RB72T4