BDBM10165 (2S)-N-[(5R)-5-[(4-aminobenzene)(2-methylpropyl)sulfonamido]-6-hydroxyhexyl]-2-[(2-methylpyridin-3-yl)formamido]-3,3-diphenylpropanamide::lysine sulfonamide analogue 26
SMILES: CC(C)CN(C(CO)CCCCNC(=O)[C@@H](NC(=O)c1cccnc1C)C(c1ccccc1)c1ccccc1)S(=O)(=O)c1ccc(N)cc1
InChI Key: InChIKey=SXDLZTIFOPNTPB-UYQMNGSLSA-N
Data: 1 KI  1 IC50
Activity Spreadsheet -- Enzyme Inhibition Constant Data from BindingDB
Found 1 hit for monomerid = 10165
Trg + Lig
Ki
nM
ΔG°
kcal/mole
IC50
nM
Kd
nM
EC50/IC50
nM
koff
s-1
kon
M-1s-1
pHTemp
°C
HIV-1 Protease
(Human immunodeficiency virus type 1)
BDBM10165
((2S)-N-[(5R)-5-[(4-aminobenzene)(2-methylpropyl)su...)
Show SMILES CC(C)CN(C(CO)CCCCNC(=O)[C@@H](NC(=O)c1cccnc1C)C(c1ccccc1)c1ccccc1)S(=O)(=O)c1ccc(N)cc1 |r|
Show InChI InChI=1S/C38H47N5O5S/c1-27(2)25-43(49(47,48)33-21-19-31(39)20-22-33)32(26-44)17-10-11-23-41-38(46)36(42-37(45)34-18-12-24-40-28(34)3)35(29-13-6-4-7-14-29)30-15-8-5-9-16-30/h4-9,12-16,18-22,24,27,32,35-36,44H,10-11,17,23,25-26,39H2,1-3H3,(H,41,46)(H,42,45)/t32?,36-/m0/s1
0.400n/a 0.400n/an/an/an/an/an/a
Ambrilia Biopharma Inc.
Assay Description
HIV-1 protease activity was measured by a continuous fluorometric assay. The proteolytic activity can be monitored by the increase in fluorescence in...
Bioorg Med Chem Lett 16: 3459-62 (2006)
Article DOI: 10.1016/j.bmcl.2006.04.011
BindingDB Entry DOI: 10.7270/Q2RB72T4