BDBM101965 US8530460, 1.45
SMILES: C[C@H](NC(C)=O)c1ccc(OC2CN(C2)c2c(F)cc(OC3CC3)cc2F)cc1
InChI Key: InChIKey=DODKMCHHKMEXES-ZDUSSCGKSA-N
Data: 1 IC50
Activity Spreadsheet -- Enzyme Inhibition Constant Data from BindingDB
Found 1 hit for monomerid = 101965
Trg + Lig
Ki
nM
ΔG°
kcal/mole
IC50
nM
Kd
nM
EC50/IC50
nM
koff
s-1
kon
M-1s-1
pHTemp
°C
Acetyl-CoA carboxylase 2 (ACC2)
(Homo sapiens (Human))
BDBM101965
(US8530460, 1.45)
Show SMILES C[C@H](NC(C)=O)c1ccc(OC2CN(C2)c2c(F)cc(OC3CC3)cc2F)cc1 |r|
Show InChI InChI=1S/C22H24F2N2O3/c1-13(25-14(2)27)15-3-5-16(6-4-15)29-19-11-26(12-19)22-20(23)9-18(10-21(22)24)28-17-7-8-17/h3-6,9-10,13,17,19H,7-8,11-12H2,1-2H3,(H,25,27)/t13-/m0/s1
US Patent
n/an/a 130n/an/an/an/an/an/a
Boehringer Ingelheim International GmbH
US Patent
Assay Description
Enzyme assay using human acetyl-CoA carboxylase 2 (ACC).
US Patent US8530460 (2013)
BindingDB Entry DOI: 10.7270/Q2X34W3N