BDBM102560 US8536172, I-9
SMILES: CS(=O)(=O)N[C@H]1CC[C@@H](CC1)Nc1nccc(n1)-n1ccc2c(cccc12)N1CCN(CC1)C(=O)CC#N
InChI Key: InChIKey=XGTBIGDWHOVXDS-MXVIHJGJSA-N
Data: 5 IC50
Activity Spreadsheet -- Enzyme Inhibition Constant Data from BindingDB
Found 5 hits for monomerid = 102560
Trg + Lig
Ki
nM
ΔG°
kcal/mole
IC50
nM
Kd
nM
EC50/IC50
nM
koff
s-1
kon
M-1s-1
pHTemp
°C
Mitogen-activated protein kinase 8
(Homo sapiens (Human))
BDBM102560
(US8536172, I-9)
Show SMILES CS(=O)(=O)N[C@H]1CC[C@@H](CC1)Nc1nccc(n1)-n1ccc2c(cccc12)N1CCN(CC1)C(=O)CC#N |r,wU:8.11,wD:5.4,(-9.56,-3.47,;-8.22,-4.24,;-8.22,-5.78,;-6.89,-5.01,;-6.89,-3.47,;-6.89,-1.93,;-5.55,-1.16,;-5.55,.38,;-6.89,1.15,;-8.22,.38,;-8.22,-1.16,;-6.89,2.69,;-5.55,3.46,;-5.55,5,;-4.22,5.78,;-2.89,5,;-2.89,3.46,;-4.22,2.69,;-1.55,2.69,;-.09,3.17,;.82,1.92,;-.09,.68,;.23,-.83,;-.91,-1.86,;-2.38,-1.38,;-2.7,.12,;-1.55,1.15,;1.72,-1.23,;2.12,-2.71,;3.61,-3.11,;4.69,-2.02,;4.3,-.54,;2.81,-.14,;6.18,-2.42,;7.27,-1.33,;6.58,-3.91,;8.07,-4.31,;9.56,-4.71,)|
Show InChI InChI=1S/C26H32N8O3S/c1-38(36,37)31-20-7-5-19(6-8-20)29-26-28-13-10-24(30-26)34-14-11-21-22(3-2-4-23(21)34)32-15-17-33(18-16-32)25(35)9-12-27/h2-4,10-11,13-14,19-20,31H,5-9,15-18H2,1H3,(H,28,29,30)/t19-,20-
NCI pathway
Reactome pathway
US Patent
n/an/a 5.40n/an/an/an/a7.5n/a
Roche Palo Alto LLC
US Patent
Assay Description
JNK activity was measured by phosphorylation of GST-ATF2 (19-96) with [gamma-33P] ATP.
US Patent US8536172 (2013)
BindingDB Entry DOI: 10.7270/Q23N222K
Mitogen-activated protein kinase 8
(Homo sapiens (Human))
BDBM102560
(US8536172, I-9)
Show SMILES CS(=O)(=O)N[C@H]1CC[C@@H](CC1)Nc1nccc(n1)-n1ccc2c(cccc12)N1CCN(CC1)C(=O)CC#N |r,wU:8.11,wD:5.4,(-9.56,-3.47,;-8.22,-4.24,;-8.22,-5.78,;-6.89,-5.01,;-6.89,-3.47,;-6.89,-1.93,;-5.55,-1.16,;-5.55,.38,;-6.89,1.15,;-8.22,.38,;-8.22,-1.16,;-6.89,2.69,;-5.55,3.46,;-5.55,5,;-4.22,5.78,;-2.89,5,;-2.89,3.46,;-4.22,2.69,;-1.55,2.69,;-.09,3.17,;.82,1.92,;-.09,.68,;.23,-.83,;-.91,-1.86,;-2.38,-1.38,;-2.7,.12,;-1.55,1.15,;1.72,-1.23,;2.12,-2.71,;3.61,-3.11,;4.69,-2.02,;4.3,-.54,;2.81,-.14,;6.18,-2.42,;7.27,-1.33,;6.58,-3.91,;8.07,-4.31,;9.56,-4.71,)|
Show InChI InChI=1S/C26H32N8O3S/c1-38(36,37)31-20-7-5-19(6-8-20)29-26-28-13-10-24(30-26)34-14-11-21-22(3-2-4-23(21)34)32-15-17-33(18-16-32)25(35)9-12-27/h2-4,10-11,13-14,19-20,31H,5-9,15-18H2,1H3,(H,28,29,30)/t19-,20-
NCI pathway
Reactome pathway
US Patent
n/an/a 36.2n/an/an/an/a7.5n/a
Roche Palo Alto LLC
US Patent
Assay Description
JNK activity was measured by phosphorylation of GST-ATF2 (19-96) with [gamma-33P] ATP.
US Patent US8536172 (2013)
BindingDB Entry DOI: 10.7270/Q23N222K
Mitogen-activated protein kinase 9
(Homo sapiens (Human))
BDBM102560
(US8536172, I-9)
Show SMILES CS(=O)(=O)N[C@H]1CC[C@@H](CC1)Nc1nccc(n1)-n1ccc2c(cccc12)N1CCN(CC1)C(=O)CC#N |r,wU:8.11,wD:5.4,(-9.56,-3.47,;-8.22,-4.24,;-8.22,-5.78,;-6.89,-5.01,;-6.89,-3.47,;-6.89,-1.93,;-5.55,-1.16,;-5.55,.38,;-6.89,1.15,;-8.22,.38,;-8.22,-1.16,;-6.89,2.69,;-5.55,3.46,;-5.55,5,;-4.22,5.78,;-2.89,5,;-2.89,3.46,;-4.22,2.69,;-1.55,2.69,;-.09,3.17,;.82,1.92,;-.09,.68,;.23,-.83,;-.91,-1.86,;-2.38,-1.38,;-2.7,.12,;-1.55,1.15,;1.72,-1.23,;2.12,-2.71,;3.61,-3.11,;4.69,-2.02,;4.3,-.54,;2.81,-.14,;6.18,-2.42,;7.27,-1.33,;6.58,-3.91,;8.07,-4.31,;9.56,-4.71,)|
Show InChI InChI=1S/C26H32N8O3S/c1-38(36,37)31-20-7-5-19(6-8-20)29-26-28-13-10-24(30-26)34-14-11-21-22(3-2-4-23(21)34)32-15-17-33(18-16-32)25(35)9-12-27/h2-4,10-11,13-14,19-20,31H,5-9,15-18H2,1H3,(H,28,29,30)/t19-,20-
NCI pathway
Reactome pathway
n/an/a 36n/an/an/an/an/an/a
Roche Palo Alto
Curated by ChEMBL
Assay Description
Inhibition of human JNK2alpha2 using GST-tagged ATF2 as substrate preincubated for 10 mins prior to substrate addition measured after 30 mins by micr...
Bioorg Med Chem Lett 23: 3565-9 (2013)
Article DOI: 10.1016/j.bmcl.2013.04.029
BindingDB Entry DOI: 10.7270/Q2MG7SF1
Mitogen-activated protein kinase 8
(Homo sapiens (Human))
BDBM102560
(US8536172, I-9)
Show SMILES CS(=O)(=O)N[C@H]1CC[C@@H](CC1)Nc1nccc(n1)-n1ccc2c(cccc12)N1CCN(CC1)C(=O)CC#N |r,wU:8.11,wD:5.4,(-9.56,-3.47,;-8.22,-4.24,;-8.22,-5.78,;-6.89,-5.01,;-6.89,-3.47,;-6.89,-1.93,;-5.55,-1.16,;-5.55,.38,;-6.89,1.15,;-8.22,.38,;-8.22,-1.16,;-6.89,2.69,;-5.55,3.46,;-5.55,5,;-4.22,5.78,;-2.89,5,;-2.89,3.46,;-4.22,2.69,;-1.55,2.69,;-.09,3.17,;.82,1.92,;-.09,.68,;.23,-.83,;-.91,-1.86,;-2.38,-1.38,;-2.7,.12,;-1.55,1.15,;1.72,-1.23,;2.12,-2.71,;3.61,-3.11,;4.69,-2.02,;4.3,-.54,;2.81,-.14,;6.18,-2.42,;7.27,-1.33,;6.58,-3.91,;8.07,-4.31,;9.56,-4.71,)|
Show InChI InChI=1S/C26H32N8O3S/c1-38(36,37)31-20-7-5-19(6-8-20)29-26-28-13-10-24(30-26)34-14-11-21-22(3-2-4-23(21)34)32-15-17-33(18-16-32)25(35)9-12-27/h2-4,10-11,13-14,19-20,31H,5-9,15-18H2,1H3,(H,28,29,30)/t19-,20-
NCI pathway
Reactome pathway
n/an/a 5n/an/an/an/an/an/a
Roche Palo Alto
Curated by ChEMBL
Assay Description
Inhibition of human JNK1alpha1 using GST-tagged ATF2 as substrate preincubated for 10 mins prior to substrate addition measured after 30 mins by micr...
Bioorg Med Chem Lett 23: 3565-9 (2013)
Article DOI: 10.1016/j.bmcl.2013.04.029
BindingDB Entry DOI: 10.7270/Q2MG7SF1
Mitogen-activated protein kinase 10/8/9
(Homo sapiens (Human))
BDBM102560
(US8536172, I-9)
Show SMILES CS(=O)(=O)N[C@H]1CC[C@@H](CC1)Nc1nccc(n1)-n1ccc2c(cccc12)N1CCN(CC1)C(=O)CC#N |r,wU:8.11,wD:5.4,(-9.56,-3.47,;-8.22,-4.24,;-8.22,-5.78,;-6.89,-5.01,;-6.89,-3.47,;-6.89,-1.93,;-5.55,-1.16,;-5.55,.38,;-6.89,1.15,;-8.22,.38,;-8.22,-1.16,;-6.89,2.69,;-5.55,3.46,;-5.55,5,;-4.22,5.78,;-2.89,5,;-2.89,3.46,;-4.22,2.69,;-1.55,2.69,;-.09,3.17,;.82,1.92,;-.09,.68,;.23,-.83,;-.91,-1.86,;-2.38,-1.38,;-2.7,.12,;-1.55,1.15,;1.72,-1.23,;2.12,-2.71,;3.61,-3.11,;4.69,-2.02,;4.3,-.54,;2.81,-.14,;6.18,-2.42,;7.27,-1.33,;6.58,-3.91,;8.07,-4.31,;9.56,-4.71,)|
Show InChI InChI=1S/C26H32N8O3S/c1-38(36,37)31-20-7-5-19(6-8-20)29-26-28-13-10-24(30-26)34-14-11-21-22(3-2-4-23(21)34)32-15-17-33(18-16-32)25(35)9-12-27/h2-4,10-11,13-14,19-20,31H,5-9,15-18H2,1H3,(H,28,29,30)/t19-,20-
NCI pathway
Reactome pathway
n/an/a 200n/an/an/an/an/an/a
Roche Palo Alto
Curated by ChEMBL
Assay Description
Inhibition of JNK-mediated c-Jun activation in TNFalpha-induced human SW1353 cells preincubated for 30 mins prior to TNFalpha treatment measured afte...
Bioorg Med Chem Lett 23: 3565-9 (2013)
Article DOI: 10.1016/j.bmcl.2013.04.029
BindingDB Entry DOI: 10.7270/Q2MG7SF1