BDBM102623 US8541572, 302
SMILES: COc1ccc2CN(C[C@]3(NC(=O)NC3=O)C#Cc3cc(F)c4c(c3)[nH][nH]c4=O)C(=O)c2c1
InChI Key: InChIKey=NKSBXHIDWFDHKE-JOCHJYFZSA-N
Data: 1 KI  1 IC50
Activity Spreadsheet -- Enzyme Inhibition Constant Data from BindingDB
Found 1 hit for monomerid = 102623
Trg + Lig
Ki
nM
ΔG°
kcal/mole
IC50
nM
Kd
nM
EC50/IC50
nM
koff
s-1
kon
M-1s-1
pHTemp
°C
Tumor necrosis factor
(Homo sapiens (Human))
BDBM102623
(US8541572, 302)
Show SMILES COc1ccc2CN(C[C@]3(NC(=O)NC3=O)C#Cc3cc(F)c4c(c3)[nH][nH]c4=O)C(=O)c2c1 |r|
Show InChI InChI=1S/C22H16FN5O5/c1-33-13-3-2-12-9-28(19(30)14(12)8-13)10-22(20(31)24-21(32)25-22)5-4-11-6-15(23)17-16(7-11)26-27-18(17)29/h2-3,6-8H,9-10H2,1H3,(H2,26,27,29)(H2,24,25,31,32)/t22-/m1/s1
Reactome pathway
US Patent
0.0521n/a 723n/an/an/an/an/an/a
Merck Sharp & Dohme Corp.
US Patent
Assay Description
Inhibition assay using TNF-alpha.
US Patent US8541572 (2013)
BindingDB Entry DOI: 10.7270/Q2QC024J