BDBM10287 Isoquinoline-1,3,4-trione 13f::N-(2-Methoxy-phenyl)-N-(1,3,4-trioxo-1,2,3,4-tetrahydro-isoquinolin-6-yl)-succinamide::N-(2-methoxyphenyl)-N'-(1,3,4-trioxo-1,2,3,4-tetrahydroisoquinolin-6-yl)butanediamide
SMILES: COc1ccccc1NC(=O)CCC(=O)Nc1ccc2C(=O)NC(=O)C(=O)c2c1
InChI Key: InChIKey=CXBBLGYLOAZXJT-UHFFFAOYSA-N
Data: 5 IC50
Activity Spreadsheet -- Enzyme Inhibition Constant Data from BindingDB
Found 5 hits for monomerid = 10287
Trg + Lig
Ki
nM
ΔG°
kcal/mole
IC50
nM
Kd
nM
EC50/IC50
nM
koff
s-1
kon
M-1s-1
pHTemp
°C
Caspase-3
(Homo sapiens (Human))
BDBM10287
(Isoquinoline-1,3,4-trione 13f | N-(2-Methoxy-pheny...)
Show SMILES COc1ccccc1NC(=O)CCC(=O)Nc1ccc2C(=O)NC(=O)C(=O)c2c1
Show InChI InChI=1S/C20H17N3O6/c1-29-15-5-3-2-4-14(15)22-17(25)9-8-16(24)21-11-6-7-12-13(10-11)18(26)20(28)23-19(12)27/h2-7,10H,8-9H2,1H3,(H,21,24)(H,22,25)(H,23,27,28)
NCI pathway
Reactome pathway
n/an/a 113n/an/an/an/an/an/a
Shanghai Institutes for Biological Sciences
Assay Description
The rate of chromogenic substrate hydrolysis was monitored by the change of absorbance at 405 nm for 3 min. Compounds were tested in duplicate. The I...
J Med Chem 49: 1613-23 (2006)
Article DOI: 10.1021/jm050896o
BindingDB Entry DOI: 10.7270/Q23N21MB
Caspase-2
(Homo sapiens (Human))
BDBM10287
(Isoquinoline-1,3,4-trione 13f | N-(2-Methoxy-pheny...)
Show SMILES COc1ccccc1NC(=O)CCC(=O)Nc1ccc2C(=O)NC(=O)C(=O)c2c1
Show InChI InChI=1S/C20H17N3O6/c1-29-15-5-3-2-4-14(15)22-17(25)9-8-16(24)21-11-6-7-12-13(10-11)18(26)20(28)23-19(12)27/h2-7,10H,8-9H2,1H3,(H,21,24)(H,22,25)(H,23,27,28)
NCI pathway
Reactome pathway
n/an/a 537n/an/an/an/an/an/a
Shanghai Institutes for Biological Sciences
Assay Description
The rate of chromogenic substrate hydrolysis was monitored by the change of absorbance at 405 nm for 3 min. Compounds were tested in duplicate. The I...
J Med Chem 49: 1613-23 (2006)
Article DOI: 10.1021/jm050896o
BindingDB Entry DOI: 10.7270/Q23N21MB
Caspase-8
(Homo sapiens (Human))
BDBM10287
(Isoquinoline-1,3,4-trione 13f | N-(2-Methoxy-pheny...)
Show SMILES COc1ccccc1NC(=O)CCC(=O)Nc1ccc2C(=O)NC(=O)C(=O)c2c1
Show InChI InChI=1S/C20H17N3O6/c1-29-15-5-3-2-4-14(15)22-17(25)9-8-16(24)21-11-6-7-12-13(10-11)18(26)20(28)23-19(12)27/h2-7,10H,8-9H2,1H3,(H,21,24)(H,22,25)(H,23,27,28)
NCI pathway
Reactome pathway
n/an/a 835n/an/an/an/an/an/a
Shanghai Institutes for Biological Sciences
Assay Description
The rate of chromogenic substrate hydrolysis was monitored by the change of absorbance at 405 nm for 3 min. Compounds were tested in duplicate. The I...
J Med Chem 49: 1613-23 (2006)
Article DOI: 10.1021/jm050896o
BindingDB Entry DOI: 10.7270/Q23N21MB
Caspase-7
(Homo sapiens (Human))
BDBM10287
(Isoquinoline-1,3,4-trione 13f | N-(2-Methoxy-pheny...)
Show SMILES COc1ccccc1NC(=O)CCC(=O)Nc1ccc2C(=O)NC(=O)C(=O)c2c1
Show InChI InChI=1S/C20H17N3O6/c1-29-15-5-3-2-4-14(15)22-17(25)9-8-16(24)21-11-6-7-12-13(10-11)18(26)20(28)23-19(12)27/h2-7,10H,8-9H2,1H3,(H,21,24)(H,22,25)(H,23,27,28)
NCI pathway
Reactome pathway
n/an/a 218n/an/an/an/an/an/a
Shanghai Institutes for Biological Sciences
Assay Description
The rate of chromogenic substrate hydrolysis was monitored by the change of absorbance at 405 nm for 3 min. Compounds were tested in duplicate. The I...
J Med Chem 49: 1613-23 (2006)
Article DOI: 10.1021/jm050896o
BindingDB Entry DOI: 10.7270/Q23N21MB
Caspase-6
(Homo sapiens (Human))
BDBM10287
(Isoquinoline-1,3,4-trione 13f | N-(2-Methoxy-pheny...)
Show SMILES COc1ccccc1NC(=O)CCC(=O)Nc1ccc2C(=O)NC(=O)C(=O)c2c1
Show InChI InChI=1S/C20H17N3O6/c1-29-15-5-3-2-4-14(15)22-17(25)9-8-16(24)21-11-6-7-12-13(10-11)18(26)20(28)23-19(12)27/h2-7,10H,8-9H2,1H3,(H,21,24)(H,22,25)(H,23,27,28)
NCI pathway
Reactome pathway
n/an/a 137n/an/an/an/an/an/a
Shanghai Institutes for Biological Sciences
Assay Description
The rate of chromogenic substrate hydrolysis was monitored by the change of absorbance at 405 nm for 3 min. Compounds were tested in duplicate. The I...
J Med Chem 49: 1613-23 (2006)
Article DOI: 10.1021/jm050896o
BindingDB Entry DOI: 10.7270/Q23N21MB