BDBM103309 US8546434, 6
SMILES: C[C@H](O)C(=O)N(C[C@@H]1CNC[C@@H]1F)[C@@H](c1nc(nn1Cc1cccc(F)c1)-c1cc(F)ccc1F)C(C)(C)C
InChI Key: InChIKey=OSIGMKFSZPQTOV-KVOAMPFWSA-N
Data: 1 IC50
Activity Spreadsheet -- Enzyme Inhibition Constant Data from BindingDB
Found 1 hit for monomerid = 103309
Trg + Lig
Ki
nM
ΔG°
kcal/mole
IC50
nM
Kd
nM
EC50/IC50
nM
koff
s-1
kon
M-1s-1
pHTemp
°C
kinesin spindle protein
(Homo sapiens (Human))
BDBM103309
(US8546434, 6)
Show SMILES C[C@H](O)C(=O)N(C[C@@H]1CNC[C@@H]1F)[C@@H](c1nc(nn1Cc1cccc(F)c1)-c1cc(F)ccc1F)C(C)(C)C |r|
Show InChI InChI=1S/C28H33F4N5O2/c1-16(38)27(39)36(15-18-12-33-13-23(18)32)24(28(2,3)4)26-34-25(21-11-20(30)8-9-22(21)31)35-37(26)14-17-6-5-7-19(29)10-17/h5-11,16,18,23-24,33,38H,12-15H2,1-4H3/t16-,18-,23-,24-/m0/s1
Reactome pathway
US Patent
n/an/a 0.830n/an/an/an/a7.537
Novartis AG
US Patent
Assay Description
In vitro activity assay using KSP.
US Patent US8546434 (2013)
BindingDB Entry DOI: 10.7270/Q25D8QG9