BDBM103558 ME0328
SMILES: C[C@H](NC(=O)CCc1nc2ccccc2c(=O)[nH]1)c1ccccc1
InChI Key: InChIKey=QIHBWVVVRYYYRO-ZDUSSCGKSA-N
Data: 5 IC50
PDB links: 1 PDB ID matches this monomer.
Activity Spreadsheet -- Enzyme Inhibition Constant Data from BindingDB
Found 5 hits for monomerid = 103558
Trg + Lig
Ki
nM
ΔG°
kcal/mole
IC50
nM
Kd
nM
EC50/IC50
nM
koff
s-1
kon
M-1s-1
pHTemp
°C
Human diphtheria toxin-like ADP-ribosyltransferase (ARTD3 or PARP3)
(Homo sapiens (Human))
BDBM103558
(ME0328)
Show SMILES C[C@H](NC(=O)CCc1nc2ccccc2c(=O)[nH]1)c1ccccc1 |r|
Show InChI InChI=1S/C19H19N3O2/c1-13(14-7-3-2-4-8-14)20-18(23)12-11-17-21-16-10-6-5-9-15(16)19(24)22-17/h2-10,13H,11-12H2,1H3,(H,20,23)(H,21,22,24)/t13-/m0/s1
n/an/a 890n/an/an/an/an/an/a
Ume£ University
Assay Description
Experiments todetermine IC50 values were conducted with compound concentrationsin the range between 10 nM and 450 μM with a DMSO concentrationof...
ACS Chem Biol 8: 1698-703 (2013)
Article DOI: 10.1021/cb4002014
BindingDB Entry DOI: 10.7270/Q2668BS1
3D
3D Structure (crystal)
Poly [ADP-ribose] polymerase 1
(Homo sapiens (Human))
BDBM103558
(ME0328)
Show SMILES C[C@H](NC(=O)CCc1nc2ccccc2c(=O)[nH]1)c1ccccc1 |r|
Show InChI InChI=1S/C19H19N3O2/c1-13(14-7-3-2-4-8-14)20-18(23)12-11-17-21-16-10-6-5-9-15(16)19(24)22-17/h2-10,13H,11-12H2,1H3,(H,20,23)(H,21,22,24)/t13-/m0/s1
n/an/a 6.30E+3n/an/an/an/an/an/a
Ume£ University
Assay Description
Experiments todetermine IC50 values were conducted with compound concentrationsin the range between 10 nM and 450 μM with a DMSO concentrationof...
ACS Chem Biol 8: 1698-703 (2013)
Article DOI: 10.1021/cb4002014
BindingDB Entry DOI: 10.7270/Q2668BS1
Human diphtheria toxin-like ADP-ribosyltransferase (ARTD3 or PARP3)
(Homo sapiens (Human))
BDBM103558
(ME0328)
Show SMILES C[C@H](NC(=O)CCc1nc2ccccc2c(=O)[nH]1)c1ccccc1 |r|
Show InChI InChI=1S/C19H19N3O2/c1-13(14-7-3-2-4-8-14)20-18(23)12-11-17-21-16-10-6-5-9-15(16)19(24)22-17/h2-10,13H,11-12H2,1H3,(H,20,23)(H,21,22,24)/t13-/m0/s1
n/an/a 900n/an/an/an/an/an/a
Ume£ University
Curated by ChEMBL
Assay Description
Inhibition of full length ATRD3 (unknown origin)
J Med Chem 56: 9556-68 (2014)
Article DOI: 10.1021/jm401394u
BindingDB Entry DOI: 10.7270/Q2Q52R32
3D
3D Structure (crystal)
Poly [ADP-ribose] polymerase 1
(Homo sapiens (Human))
BDBM103558
(ME0328)
Show SMILES C[C@H](NC(=O)CCc1nc2ccccc2c(=O)[nH]1)c1ccccc1 |r|
Show InChI InChI=1S/C19H19N3O2/c1-13(14-7-3-2-4-8-14)20-18(23)12-11-17-21-16-10-6-5-9-15(16)19(24)22-17/h2-10,13H,11-12H2,1H3,(H,20,23)(H,21,22,24)/t13-/m0/s1
n/an/a 3.70E+3n/an/an/an/an/an/a
Ume£ University
Curated by ChEMBL
Assay Description
Inhibition of catalytic domain of ATRD1 (unknown origin)
J Med Chem 56: 9556-68 (2014)
Article DOI: 10.1021/jm401394u
BindingDB Entry DOI: 10.7270/Q2Q52R32
Poly [ADP-ribose] polymerase 1
(Homo sapiens (Human))
BDBM103558
(ME0328)
Show SMILES C[C@H](NC(=O)CCc1nc2ccccc2c(=O)[nH]1)c1ccccc1 |r|
Show InChI InChI=1S/C19H19N3O2/c1-13(14-7-3-2-4-8-14)20-18(23)12-11-17-21-16-10-6-5-9-15(16)19(24)22-17/h2-10,13H,11-12H2,1H3,(H,20,23)(H,21,22,24)/t13-/m0/s1
n/an/a 6.30E+3n/an/an/an/an/an/a
Ume£ University
Curated by ChEMBL
Assay Description
Inhibition of full length ATRD1 (unknown origin)
J Med Chem 56: 9556-68 (2014)
Article DOI: 10.1021/jm401394u
BindingDB Entry DOI: 10.7270/Q2Q52R32