BDBM103677 US8563553, 102
SMILES: CC1(CC1)c1nc(c([nH]1)-c1cc(Cl)cc(NS(C)(=O)=O)c1F)-c1ccnc(NCCC#N)n1
InChI Key: InChIKey=JXUVQKLLPWLOHV-UHFFFAOYSA-N
Data: 1 IC50
Activity Spreadsheet -- Enzyme Inhibition Constant Data from BindingDB
Found 1 hit for monomerid = 103677
Trg + Lig
Ki
nM
ΔG°
kcal/mole
IC50
nM
Kd
nM
EC50/IC50
nM
koff
s-1
kon
M-1s-1
pHTemp
°C
B-RAF V600E
(Homo sapiens (Human))
BDBM103677
(US8563553, 102)
Show SMILES CC1(CC1)c1nc(c([nH]1)-c1cc(Cl)cc(NS(C)(=O)=O)c1F)-c1ccnc(NCCC#N)n1
Show InChI InChI=1S/C21H21ClFN7O2S/c1-21(5-6-21)19-28-17(13-10-12(22)11-15(16(13)23)30-33(2,31)32)18(29-19)14-4-9-26-20(27-14)25-8-3-7-24/h4,9-11,30H,3,5-6,8H2,1-2H3,(H,28,29)(H,25,26,27)
US Patent
n/an/a 0.110n/an/an/an/a7.5n/a
Novartis AG; IRM LLC
US Patent
Assay Description
Raf/Mek amplified luminescence proximity homogeneous assay.
US Patent US8563553 (2013)
BindingDB Entry DOI: 10.7270/Q2ZP44R7