BDBM103694 US8563553, 119
SMILES: CCCS(=O)(=O)Nc1cc(F)cc(-c2[nH]c(nc2-c2ccnc(N)n2)C2CC2)c1Cl
InChI Key: InChIKey=BYEHWNZMGUJXQL-UHFFFAOYSA-N
Data: 1 IC50
Activity Spreadsheet -- Enzyme Inhibition Constant Data from BindingDB
Found 1 hit for monomerid = 103694
Trg + Lig
Ki
nM
ΔG°
kcal/mole
IC50
nM
Kd
nM
EC50/IC50
nM
koff
s-1
kon
M-1s-1
pHTemp
°C
B-RAF V600E
(Homo sapiens (Human))
BDBM103694
(US8563553, 119)
Show SMILES CCCS(=O)(=O)Nc1cc(F)cc(-c2[nH]c(nc2-c2ccnc(N)n2)C2CC2)c1Cl
Show InChI InChI=1S/C19H20ClFN6O2S/c1-2-7-30(28,29)27-14-9-11(21)8-12(15(14)20)16-17(13-5-6-23-19(22)24-13)26-18(25-16)10-3-4-10/h5-6,8-10,27H,2-4,7H2,1H3,(H,25,26)(H2,22,23,24)
US Patent
n/an/a 0.200n/an/an/an/a7.5n/a
Novartis AG; IRM LLC
US Patent
Assay Description
Raf/Mek amplified luminescence proximity homogeneous assay.
US Patent US8563553 (2013)
BindingDB Entry DOI: 10.7270/Q2ZP44R7