BDBM103695 US8563553, 120
SMILES: COC(=O)N[C@@H](C)CNc1nccc(n1)-c1nc([nH]c1-c1cc(Cl)cc(NS(C)(=O)=O)c1F)C1CCC1
InChI Key: InChIKey=PWHZZYHTPVVWLA-LBPRGKRZSA-N
Data: 1 IC50
Activity Spreadsheet -- Enzyme Inhibition Constant Data from BindingDB
Found 1 hit for monomerid = 103695
Trg + Lig
Ki
nM
ΔG°
kcal/mole
IC50
nM
Kd
nM
EC50/IC50
nM
koff
s-1
kon
M-1s-1
pHTemp
°C
B-RAF V600E
(Homo sapiens (Human))
BDBM103695
(US8563553, 120)
Show SMILES COC(=O)N[C@@H](C)CNc1nccc(n1)-c1nc([nH]c1-c1cc(Cl)cc(NS(C)(=O)=O)c1F)C1CCC1 |r|
Show InChI InChI=1S/C23H27ClFN7O4S/c1-12(28-23(33)36-2)11-27-22-26-8-7-16(29-22)20-19(30-21(31-20)13-5-4-6-13)15-9-14(24)10-17(18(15)25)32-37(3,34)35/h7-10,12-13,32H,4-6,11H2,1-3H3,(H,28,33)(H,30,31)(H,26,27,29)/t12-/m0/s1
US Patent
n/an/a 0.230n/an/an/an/a7.5n/a
Novartis AG; IRM LLC
US Patent
Assay Description
Raf/Mek amplified luminescence proximity homogeneous assay.
US Patent US8563553 (2013)
BindingDB Entry DOI: 10.7270/Q2ZP44R7