null
SMILES: CS(=O)(=O)Nc1cc(Cl)cc(-c2[nH]c(nc2-c2ccnc(NCCC#N)n2)C2CC2)c1F
InChI Key: InChIKey=SLOWBIWRFDGYFV-UHFFFAOYSA-N
Activity Spreadsheet -- Enzyme Inhibition Constant Data from BindingDB
Found 1 hit for monomerid = 103702
Trg + Lig
Ki
nM
ΔG°
kcal/mole
IC50
nM
Kd
nM
EC50/IC50
nM
koff
s-1
kon
M-1s-1
pHTemp
°C
Serine/threonine-protein kinase B-raf [V600E]
(Homo sapiens (Human))
BDBM103702
(US8563553, 127)
Show SMILES CS(=O)(=O)Nc1cc(Cl)cc(-c2[nH]c(nc2-c2ccnc(NCCC#N)n2)C2CC2)c1F
Show InChI InChI=1S/C20H19ClFN7O2S/c1-32(30,31)29-15-10-12(21)9-13(16(15)22)17-18(28-19(27-17)11-3-4-11)14-5-8-25-20(26-14)24-7-2-6-23/h5,8-11,29H,2-4,7H2,1H3,(H,27,28)(H,24,25,26)
US Patent
n/an/a 0.0800n/an/an/an/a7.5n/a
Novartis AG; IRM LLC
US Patent
Assay Description
Raf/Mek amplified luminescence proximity homogeneous assay.
US Patent US8563553 (2013)
BindingDB Entry DOI: 10.7270/Q2ZP44R7