BDBM103717 US8563553, 142
SMILES: CCCS(=O)(=O)Nc1cccc(-c2[nH]c(nc2-c2ccnc(NC[C@H](C)NC(=O)OC)n2)C2CC2)c1F
InChI Key: InChIKey=ZXNBJUUFIKPXGS-AWEZNQCLSA-N
Data: 1 IC50
Activity Spreadsheet -- Enzyme Inhibition Constant Data from BindingDB
Found 1 hit for monomerid = 103717
Trg + Lig
Ki
nM
ΔG°
kcal/mole
IC50
nM
Kd
nM
EC50/IC50
nM
koff
s-1
kon
M-1s-1
pHTemp
°C
B-RAF V600E
(Homo sapiens (Human))
BDBM103717
(US8563553, 142)
Show SMILES CCCS(=O)(=O)Nc1cccc(-c2[nH]c(nc2-c2ccnc(NC[C@H](C)NC(=O)OC)n2)C2CC2)c1F |r|
Show InChI InChI=1S/C24H30FN7O4S/c1-4-12-37(34,35)32-17-7-5-6-16(19(17)25)20-21(31-22(30-20)15-8-9-15)18-10-11-26-23(29-18)27-13-14(2)28-24(33)36-3/h5-7,10-11,14-15,32H,4,8-9,12-13H2,1-3H3,(H,28,33)(H,30,31)(H,26,27,29)/t14-/m0/s1
US Patent
n/an/a 0.160n/an/an/an/a7.5n/a
Novartis AG; IRM LLC
US Patent
Assay Description
Raf/Mek amplified luminescence proximity homogeneous assay.
US Patent US8563553 (2013)
BindingDB Entry DOI: 10.7270/Q2ZP44R7