BDBM103726 US8563553, 151
SMILES: COC(=O)N[C@@H](C)CNc1nccc(n1)-c1nc([nH]c1-c1cc(F)cc(NS(C)(=O)=O)c1Cl)C1CC1
InChI Key: InChIKey=USTQEUSYKXURJE-NSHDSACASA-N
Data: 1 IC50
Activity Spreadsheet -- Enzyme Inhibition Constant Data from BindingDB
Found 1 hit for monomerid = 103726
Trg + Lig
Ki
nM
ΔG°
kcal/mole
IC50
nM
Kd
nM
EC50/IC50
nM
koff
s-1
kon
M-1s-1
pHTemp
°C
Serine/threonine-protein kinase B-raf [V600E]
(Homo sapiens (Human))
BDBM103726
(US8563553, 151)
Show SMILES COC(=O)N[C@@H](C)CNc1nccc(n1)-c1nc([nH]c1-c1cc(F)cc(NS(C)(=O)=O)c1Cl)C1CC1 |r|
Show InChI InChI=1S/C22H25ClFN7O4S/c1-11(27-22(32)35-2)10-26-21-25-7-6-15(28-21)19-18(29-20(30-19)12-4-5-12)14-8-13(24)9-16(17(14)23)31-36(3,33)34/h6-9,11-12,31H,4-5,10H2,1-3H3,(H,27,32)(H,29,30)(H,25,26,28)/t11-/m0/s1
US Patent
n/an/a 0.400n/an/an/an/a7.5n/a
Novartis AG; IRM LLC
US Patent
Assay Description
Raf/Mek amplified luminescence proximity homogeneous assay.
US Patent US8563553 (2013)
BindingDB Entry DOI: 10.7270/Q2ZP44R7