BDBM103787 US8551978, I-57::US8816088, I-57::US9682957, I-57
SMILES: C[C@H](Cc1ccc(CCNC(=O)c2ccc(cc2)N(C)C(=O)CCN2CCC(CC2)OC(=O)Nc2ccccc2-c2ccccc2)cc1)NC[C@H](O)c1ccc(O)c2[nH]c(=O)ccc12
InChI Key: InChIKey=BODWRNBUQHEVTC-MZCJWYLYSA-N
Data: 3 KI  1 EC50
Activity Spreadsheet -- Enzyme Inhibition Constant Data from BindingDB
Found 4 hits for monomerid = 103787
Trg + Lig
Ki
nM
ΔG°
kcal/mole
IC50
nM
Kd
nM
EC50/IC50
nM
koff
s-1
kon
M-1s-1
pHTemp
°C
Muscarinic acetylcholine receptor M3
(Homo sapiens (Human))
BDBM103787
(US8551978, I-57 | US8816088, I-57 | US9682957, I-5...)
Show SMILES C[C@H](Cc1ccc(CCNC(=O)c2ccc(cc2)N(C)C(=O)CCN2CCC(CC2)OC(=O)Nc2ccccc2-c2ccccc2)cc1)NC[C@H](O)c1ccc(O)c2[nH]c(=O)ccc12 |r|
Show InChI InChI=1S/C51H56N6O7/c1-34(53-33-46(59)42-20-22-45(58)49-43(42)21-23-47(60)55-49)32-36-14-12-35(13-15-36)24-28-52-50(62)38-16-18-39(19-17-38)56(2)48(61)27-31-57-29-25-40(26-30-57)64-51(63)54-44-11-7-6-10-41(44)37-8-4-3-5-9-37/h3-23,34,40,46,53,58-59H,24-33H2,1-2H3,(H,52,62)(H,54,63)(H,55,60)/t34-,46+/m1/s1
Reactome pathway
US Patent
0.100n/an/an/an/an/an/an/an/a
Theravance, Inc.
US Patent
Assay Description
Radioligand binding assay using muscarinic receptors.
US Patent US8551978 (2013)
BindingDB Entry DOI: 10.7270/Q2Q81BPC
Muscarinic acetylcholine receptor M3
(Homo sapiens (Human))
BDBM103787
(US8551978, I-57 | US8816088, I-57 | US9682957, I-5...)
Show SMILES C[C@H](Cc1ccc(CCNC(=O)c2ccc(cc2)N(C)C(=O)CCN2CCC(CC2)OC(=O)Nc2ccccc2-c2ccccc2)cc1)NC[C@H](O)c1ccc(O)c2[nH]c(=O)ccc12 |r|
Show InChI InChI=1S/C51H56N6O7/c1-34(53-33-46(59)42-20-22-45(58)49-43(42)21-23-47(60)55-49)32-36-14-12-35(13-15-36)24-28-52-50(62)38-16-18-39(19-17-38)56(2)48(61)27-31-57-29-25-40(26-30-57)64-51(63)54-44-11-7-6-10-41(44)37-8-4-3-5-9-37/h3-23,34,40,46,53,58-59H,24-33H2,1-2H3,(H,52,62)(H,54,63)(H,55,60)/t34-,46+/m1/s1
Reactome pathway
US Patent
0.100n/an/an/an/an/an/an/an/a
Theravance Respiratory Company, LLC
US Patent
Assay Description
Radioligand binding assays for cloned muscarinic receptors were performed in 96-well microtiter plates in a total assay volume of 100 uL. CHO cell me...
US Patent US8816088 (2014)
BindingDB Entry DOI: 10.7270/Q2TQ6068
Muscarinic acetylcholine receptor M3
(Homo sapiens (Human))
BDBM103787
(US8551978, I-57 | US8816088, I-57 | US9682957, I-5...)
Show SMILES C[C@H](Cc1ccc(CCNC(=O)c2ccc(cc2)N(C)C(=O)CCN2CCC(CC2)OC(=O)Nc2ccccc2-c2ccccc2)cc1)NC[C@H](O)c1ccc(O)c2[nH]c(=O)ccc12 |r|
Show InChI InChI=1S/C51H56N6O7/c1-34(53-33-46(59)42-20-22-45(58)49-43(42)21-23-47(60)55-49)32-36-14-12-35(13-15-36)24-28-52-50(62)38-16-18-39(19-17-38)56(2)48(61)27-31-57-29-25-40(26-30-57)64-51(63)54-44-11-7-6-10-41(44)37-8-4-3-5-9-37/h3-23,34,40,46,53,58-59H,24-33H2,1-2H3,(H,52,62)(H,54,63)(H,55,60)/t34-,46+/m1/s1
Reactome pathway
US Patent
0.100n/an/an/an/an/an/an/an/a
Theravance Respiratory Company, LLC
US Patent
Assay Description
Radioligand binding assays for cloned muscarinic receptors were performed in 96-well microtiter plates in a total assay volume of 100 μL. CHO ce...
US Patent US9682957 (2017)
BindingDB Entry DOI: 10.7270/Q23776WR
Beta-2 adrenergic receptor
(Homo sapiens (Human))
BDBM103787
(US8551978, I-57 | US8816088, I-57 | US9682957, I-5...)
Show SMILES C[C@H](Cc1ccc(CCNC(=O)c2ccc(cc2)N(C)C(=O)CCN2CCC(CC2)OC(=O)Nc2ccccc2-c2ccccc2)cc1)NC[C@H](O)c1ccc(O)c2[nH]c(=O)ccc12 |r|
Show InChI InChI=1S/C51H56N6O7/c1-34(53-33-46(59)42-20-22-45(58)49-43(42)21-23-47(60)55-49)32-36-14-12-35(13-15-36)24-28-52-50(62)38-16-18-39(19-17-38)56(2)48(61)27-31-57-29-25-40(26-30-57)64-51(63)54-44-11-7-6-10-41(44)37-8-4-3-5-9-37/h3-23,34,40,46,53,58-59H,24-33H2,1-2H3,(H,52,62)(H,54,63)(H,55,60)/t34-,46+/m1/s1
Reactome pathway
US Patent
n/an/an/an/a 1n/an/an/a25
Theravance Respiratory Company, LLC
US Patent
Assay Description
cAMP assays were performed in a radioimmunoassay format using the Flashplate Adenylyl Cyclase Activation Assay System with [125I]-cAMP (NEN SMP004, P...
US Patent US9682957 (2017)
BindingDB Entry DOI: 10.7270/Q23776WR