BDBM103818 US8551978, I-89::US8816088, I-89::US9394275, I-89::US9572802, Compound I-89::US9682957, I-89
SMILES: C[C@@H](Cc1ccc(CCNC(=O)Cc2ccc(cc2)N(C)C(=O)CCN2CCC(CC2)OC(=O)Nc2ccccc2-c2ccccc2)cc1)NC[C@H](O)c1ccc(O)c2[nH]c(=O)ccc12
InChI Key: InChIKey=JVRDCTUOXNGKAJ-XEWCOGJJSA-N
Data: 5 KI  2 EC50
Activity Spreadsheet -- Enzyme Inhibition Constant Data from BindingDB
Found 7 hits for monomerid = 103818
Trg + Lig
Ki
nM
ΔG°
kcal/mole
IC50
nM
Kd
nM
EC50/IC50
nM
koff
s-1
kon
M-1s-1
pHTemp
°C
Muscarinic acetylcholine receptor M3
(Homo sapiens (Human))
BDBM103818
(US8551978, I-89 | US8816088, I-89 | US9394275, I-8...)
Show SMILES C[C@@H](Cc1ccc(CCNC(=O)Cc2ccc(cc2)N(C)C(=O)CCN2CCC(CC2)OC(=O)Nc2ccccc2-c2ccccc2)cc1)NC[C@H](O)c1ccc(O)c2[nH]c(=O)ccc12 |r|
Show InChI InChI=1S/C52H58N6O7/c1-35(54-34-47(60)43-20-22-46(59)51-44(43)21-23-48(61)56-51)32-37-14-12-36(13-15-37)24-28-53-49(62)33-38-16-18-40(19-17-38)57(2)50(63)27-31-58-29-25-41(26-30-58)65-52(64)55-45-11-7-6-10-42(45)39-8-4-3-5-9-39/h3-23,35,41,47,54,59-60H,24-34H2,1-2H3,(H,53,62)(H,55,64)(H,56,61)/t35-,47-/m0/s1
Reactome pathway
US Patent
0.100n/an/an/an/an/an/an/an/a
Theravance, Inc.
US Patent
Assay Description
Radioligand binding assay using muscarinic receptors.
US Patent US8551978 (2013)
BindingDB Entry DOI: 10.7270/Q2Q81BPC
Muscarinic acetylcholine receptor M3
(Homo sapiens (Human))
BDBM103818
(US8551978, I-89 | US8816088, I-89 | US9394275, I-8...)
Show SMILES C[C@@H](Cc1ccc(CCNC(=O)Cc2ccc(cc2)N(C)C(=O)CCN2CCC(CC2)OC(=O)Nc2ccccc2-c2ccccc2)cc1)NC[C@H](O)c1ccc(O)c2[nH]c(=O)ccc12 |r|
Show InChI InChI=1S/C52H58N6O7/c1-35(54-34-47(60)43-20-22-46(59)51-44(43)21-23-48(61)56-51)32-37-14-12-36(13-15-37)24-28-53-49(62)33-38-16-18-40(19-17-38)57(2)50(63)27-31-58-29-25-41(26-30-58)65-52(64)55-45-11-7-6-10-42(45)39-8-4-3-5-9-39/h3-23,35,41,47,54,59-60H,24-34H2,1-2H3,(H,53,62)(H,55,64)(H,56,61)/t35-,47-/m0/s1
Reactome pathway
US Patent
0.100n/an/an/an/an/an/an/an/a
Theravance Respiratory Company, LLC
US Patent
Assay Description
Radioligand binding assays for cloned muscarinic receptors were performed in 96-well microtiter plates in a total assay volume of 100 uL. CHO cell me...
US Patent US8816088 (2014)
BindingDB Entry DOI: 10.7270/Q2TQ6068
Muscarinic acetylcholine receptor M3
(Homo sapiens (Human))
BDBM103818
(US8551978, I-89 | US8816088, I-89 | US9394275, I-8...)
Show SMILES C[C@@H](Cc1ccc(CCNC(=O)Cc2ccc(cc2)N(C)C(=O)CCN2CCC(CC2)OC(=O)Nc2ccccc2-c2ccccc2)cc1)NC[C@H](O)c1ccc(O)c2[nH]c(=O)ccc12 |r|
Show InChI InChI=1S/C52H58N6O7/c1-35(54-34-47(60)43-20-22-46(59)51-44(43)21-23-48(61)56-51)32-37-14-12-36(13-15-37)24-28-53-49(62)33-38-16-18-40(19-17-38)57(2)50(63)27-31-58-29-25-41(26-30-58)65-52(64)55-45-11-7-6-10-42(45)39-8-4-3-5-9-39/h3-23,35,41,47,54,59-60H,24-34H2,1-2H3,(H,53,62)(H,55,64)(H,56,61)/t35-,47-/m0/s1
Reactome pathway
US Patent
0.100 -14.2n/an/an/an/an/an/a37
Theravance Respiratory Company, LLC
US Patent
Assay Description
Displacement assays for determination of Ki values of test compounds were performed with [3H]-NMS at 1 nM and eleven different test compound concentr...
US Patent US9394275 (2016)
BindingDB Entry DOI: 10.7270/Q2NS0SS8
Muscarinic acetylcholine receptor M3
(Homo sapiens (Human))
BDBM103818
(US8551978, I-89 | US8816088, I-89 | US9394275, I-8...)
Show SMILES C[C@@H](Cc1ccc(CCNC(=O)Cc2ccc(cc2)N(C)C(=O)CCN2CCC(CC2)OC(=O)Nc2ccccc2-c2ccccc2)cc1)NC[C@H](O)c1ccc(O)c2[nH]c(=O)ccc12 |r|
Show InChI InChI=1S/C52H58N6O7/c1-35(54-34-47(60)43-20-22-46(59)51-44(43)21-23-48(61)56-51)32-37-14-12-36(13-15-37)24-28-53-49(62)33-38-16-18-40(19-17-38)57(2)50(63)27-31-58-29-25-41(26-30-58)65-52(64)55-45-11-7-6-10-42(45)39-8-4-3-5-9-39/h3-23,35,41,47,54,59-60H,24-34H2,1-2H3,(H,53,62)(H,55,64)(H,56,61)/t35-,47-/m0/s1
Reactome pathway
US Patent
0.100n/an/an/an/an/an/an/an/a
Theravance Respiratory Company LLC
US Patent
Assay Description
compounds were performed with [3H]NMS at 1 nM and eleven different test compound concentrations. The test compounds were initially dissolved to a con...
US Patent US9572802 (2017)
BindingDB Entry DOI: 10.7270/Q2VH5QWS
Muscarinic acetylcholine receptor M3
(Homo sapiens (Human))
BDBM103818
(US8551978, I-89 | US8816088, I-89 | US9394275, I-8...)
Show SMILES C[C@@H](Cc1ccc(CCNC(=O)Cc2ccc(cc2)N(C)C(=O)CCN2CCC(CC2)OC(=O)Nc2ccccc2-c2ccccc2)cc1)NC[C@H](O)c1ccc(O)c2[nH]c(=O)ccc12 |r|
Show InChI InChI=1S/C52H58N6O7/c1-35(54-34-47(60)43-20-22-46(59)51-44(43)21-23-48(61)56-51)32-37-14-12-36(13-15-37)24-28-53-49(62)33-38-16-18-40(19-17-38)57(2)50(63)27-31-58-29-25-41(26-30-58)65-52(64)55-45-11-7-6-10-42(45)39-8-4-3-5-9-39/h3-23,35,41,47,54,59-60H,24-34H2,1-2H3,(H,53,62)(H,55,64)(H,56,61)/t35-,47-/m0/s1
Reactome pathway
US Patent
0.100n/an/an/an/an/an/an/an/a
Theravance Respiratory Company, LLC
US Patent
Assay Description
Radioligand binding assays for cloned muscarinic receptors were performed in 96-well microtiter plates in a total assay volume of 100 μL. CHO ce...
US Patent US9682957 (2017)
BindingDB Entry DOI: 10.7270/Q23776WR
Beta-2 adrenergic receptor
(Homo sapiens (Human))
BDBM103818
(US8551978, I-89 | US8816088, I-89 | US9394275, I-8...)
Show SMILES C[C@@H](Cc1ccc(CCNC(=O)Cc2ccc(cc2)N(C)C(=O)CCN2CCC(CC2)OC(=O)Nc2ccccc2-c2ccccc2)cc1)NC[C@H](O)c1ccc(O)c2[nH]c(=O)ccc12 |r|
Show InChI InChI=1S/C52H58N6O7/c1-35(54-34-47(60)43-20-22-46(59)51-44(43)21-23-48(61)56-51)32-37-14-12-36(13-15-37)24-28-53-49(62)33-38-16-18-40(19-17-38)57(2)50(63)27-31-58-29-25-41(26-30-58)65-52(64)55-45-11-7-6-10-42(45)39-8-4-3-5-9-39/h3-23,35,41,47,54,59-60H,24-34H2,1-2H3,(H,53,62)(H,55,64)(H,56,61)/t35-,47-/m0/s1
Reactome pathway
US Patent
n/an/an/an/a 1n/an/an/a25
Theravance Respiratory Company, LLC
US Patent
Assay Description
cAMP assays were performed in a radioimmunoassay format using the Flashplate Adenylyl Cyclase Activation Assay System with [125I]-cAMP (NEN SMP004, P...
US Patent US9682957 (2017)
BindingDB Entry DOI: 10.7270/Q23776WR
Beta-2 adrenergic receptor
(Homo sapiens (Human))
BDBM103818
(US8551978, I-89 | US8816088, I-89 | US9394275, I-8...)
Show SMILES C[C@@H](Cc1ccc(CCNC(=O)Cc2ccc(cc2)N(C)C(=O)CCN2CCC(CC2)OC(=O)Nc2ccccc2-c2ccccc2)cc1)NC[C@H](O)c1ccc(O)c2[nH]c(=O)ccc12 |r|
Show InChI InChI=1S/C52H58N6O7/c1-35(54-34-47(60)43-20-22-46(59)51-44(43)21-23-48(61)56-51)32-37-14-12-36(13-15-37)24-28-53-49(62)33-38-16-18-40(19-17-38)57(2)50(63)27-31-58-29-25-41(26-30-58)65-52(64)55-45-11-7-6-10-42(45)39-8-4-3-5-9-39/h3-23,35,41,47,54,59-60H,24-34H2,1-2H3,(H,53,62)(H,55,64)(H,56,61)/t35-,47-/m0/s1
Reactome pathway
US Patent
n/an/an/an/a 1n/an/an/a37
Theravance Respiratory Company, LLC
US Patent
Assay Description
cAMP assays were performed in a radioimmunoassay format using the Flashplate Adenylyl Cyclase Activation Assay System with [125I]-cAMP (NEN SMP004, P...
US Patent US9394275 (2016)
BindingDB Entry DOI: 10.7270/Q2NS0SS8