BDBM104202 US8575145, 79
SMILES: FC1(COc2cccc3ccc(nc23)-c2nnc3ccc(cn23)C2CC2)CCNCC1
InChI Key: InChIKey=LUTLMEWAYGPCHC-UHFFFAOYSA-N
Data: 2 IC50
Activity Spreadsheet -- Enzyme Inhibition Constant Data from BindingDB
Found 2 hits for monomerid = 104202
Trg + Lig
Ki
nM
ΔG°
kcal/mole
IC50
nM
Kd
nM
EC50/IC50
nM
koff
s-1
kon
M-1s-1
pHTemp
°C
Serine/threonine-protein kinase pim-2
(Homo sapiens (Human))
BDBM104202
(US8575145, 79)
Show SMILES FC1(COc2cccc3ccc(nc23)-c2nnc3ccc(cn23)C2CC2)CCNCC1
Show InChI InChI=1S/C24H24FN5O/c25-24(10-12-26-13-11-24)15-31-20-3-1-2-17-6-8-19(27-22(17)20)23-29-28-21-9-7-18(14-30(21)23)16-4-5-16/h1-3,6-9,14,16,26H,4-5,10-13,15H2
US Patent
n/an/a 55n/an/an/an/a7.422
Array BioPharma Inc.
US Patent
Assay Description
The assay for the determination of PIM activity is based on the incorporation of [33P] ATP into PIM2tide substrate and capture of the radiolabeled pe...
US Patent US8575145 (2013)
BindingDB Entry DOI: 10.7270/Q2M90797
Serine/threonine-protein kinase pim-1
(Homo sapiens (Human))
BDBM104202
(US8575145, 79)
Show SMILES FC1(COc2cccc3ccc(nc23)-c2nnc3ccc(cn23)C2CC2)CCNCC1
Show InChI InChI=1S/C24H24FN5O/c25-24(10-12-26-13-11-24)15-31-20-3-1-2-17-6-8-19(27-22(17)20)23-29-28-21-9-7-18(14-30(21)23)16-4-5-16/h1-3,6-9,14,16,26H,4-5,10-13,15H2
US Patent
n/an/a 0.200n/an/an/an/a7.422
Array BioPharma Inc.
US Patent
Assay Description
The assay for the determination of PIM activity is based on the incorporation of [33P] ATP into PIM2tide substrate and capture of the radiolabeled pe...
US Patent US8575145 (2013)
BindingDB Entry DOI: 10.7270/Q2M90797