BDBM104547 US8575201, 38
SMILES: COC(=O)[C@H]1CNCCN1c1ccc(cn1)-c1nc(no1)C1(CCC1)c1ccc(nc1)-c1cnc(N)nc1
InChI Key: InChIKey=LABMRJMAQQPSHF-HXUWFJFHSA-N
Data: 1 IC50
Activity Spreadsheet -- Enzyme Inhibition Constant Data from BindingDB
Found 1 hit for monomerid = 104547
Trg + Lig
Ki
nM
ΔG°
kcal/mole
IC50
nM
Kd
nM
EC50/IC50
nM
koff
s-1
kon
M-1s-1
pHTemp
°C
Arachidonate 5-lipoxygenase-activating protein
(Homo sapiens (Human))
BDBM104547
(US8575201, 38)
Show SMILES COC(=O)[C@H]1CNCCN1c1ccc(cn1)-c1nc(no1)C1(CCC1)c1ccc(nc1)-c1cnc(N)nc1 |r|
Show InChI InChI=1S/C26H27N9O3/c1-37-23(36)20-15-28-9-10-35(20)21-6-3-16(11-30-21)22-33-24(34-38-22)26(7-2-8-26)18-4-5-19(29-14-18)17-12-31-25(27)32-13-17/h3-6,11-14,20,28H,2,7-10,15H2,1H3,(H2,27,31,32)/t20-/m1/s1
Reactome pathway
US Patent
n/an/a 3.20n/an/an/an/an/an/a
Boehringer Ingelheim International GmbH
US Patent
Assay Description
Compounds area assessed for the ability to bind to FLAP in a binding assay that measures compound-specific displacement of an iodinated (125I) FLAP i...
US Patent US8575201 (2013)
BindingDB Entry DOI: 10.7270/Q2ZK5FBX